Opened 11 years ago

Closed 11 years ago

#604 closed Bug Report (fixed)

Patchage r2712 and r2713 fail to build

Reported by: cook60020tmp@… Owned by: David Robillard
Priority: major Component: Build System
Keywords: Cc:

Description

Configuring: $ ./waf configure --prefix=/usr --jack-dbus

Build log for r2713:

$ ./waf build
Waf: Entering directory `/home/__shared/pub/build/vc/svn/drobilla-lad/patchage/build'
[ 1/18] cxx: src/Client.cpp -> build/default/src/Client_1.o
[ 2/18] cxx: src/Patchage.cpp -> build/default/src/Patchage_1.o                                                                                                              
[ 3/18] cxx: src/PatchageCanvas.cpp -> build/default/src/PatchageCanvas_1.o                                                                                                  
[ 4/18] cxx: src/PatchageEvent.cpp -> build/default/src/PatchageEvent_1.o                                                                                                    
[ 5/18] cxx: src/PatchageModule.cpp -> build/default/src/PatchageModule_1.o                                                                                                  
[ 6/18] cxx: src/StateManager.cpp -> build/default/src/StateManager_1.o                                                                                                      
[ 7/18] cxx: src/main.cpp -> build/default/src/main_1.o                                                                                                                      
[ 8/18] cxx: src/JackDbusDriver.cpp -> build/default/src/JackDbusDriver_1.o                                                                                                  
[ 9/18] cxx: src/LashProxy.cpp -> build/default/src/LashProxy_1.o                                                                                                            
../src/JackDbusDriver.cpp: In member function ‘void JackDriver::remove_port(dbus_uint64_t, const char*, dbus_uint64_t, const char*)’:                                        
../src/JackDbusDriver.cpp:603:79: error: ‘class PatchageCanvas’ has no member named ‘get_port’
../src/JackDbusDriver.cpp: In member function ‘void JackDriver::connect_ports(dbus_uint64_t, dbus_uint64_t, const char*, dbus_uint64_t, const char*, dbus_uint64_t, const char*, dbus_uint64_t, const char*)’:
../src/JackDbusDriver.cpp:661:80: error: ‘class PatchageCanvas’ has no member named ‘get_port’
../src/JackDbusDriver.cpp:667:80: error: ‘class PatchageCanvas’ has no member named ‘get_port’
../src/JackDbusDriver.cpp: In member function ‘void JackDriver::disconnect_ports(dbus_uint64_t, dbus_uint64_t, const char*, dbus_uint64_t, const char*, dbus_uint64_t, const char*, dbus_uint64_t, const char*)’:
../src/JackDbusDriver.cpp:689:80: error: ‘class PatchageCanvas’ has no member named ‘get_port’
../src/JackDbusDriver.cpp:695:80: error: ‘class PatchageCanvas’ has no member named ‘get_port’
Waf: Leaving directory `/home/__shared/pub/build/vc/svn/drobilla-lad/patchage/build'
Build failed:  -> task failed (err #1): 
        {task: cxx JackDbusDriver.cpp -> JackDbusDriver_1.o}

Change History (1)

comment:1 Changed 11 years ago by David Robillard

Resolution: fixed
Status: newclosed

Fixed in r2717.

Note: See TracTickets for help on using tickets.